Reaction Details
TargetHistone deacetylase 8
LigandBDBM50259807
Substrate/Competitorn/a
Meas. Tech.ChEBML_1691855
IC50 16200±n/a nM
Citation Lee, HYLee, JFKumar, SWu, YWHuangFu, WCLai, MJLi, YHHuang, HLKuo, FCHsiao, CJCheng, CCYang, CRLiou, JP 3-Aroylindoles display antitumor activity in vitro and in vivo: Effects of N1-substituents on biological activity. Eur J Med Chem125:1268-1278 (2017) 
 
Histone deacetylase 8
Name:Histone deacetylase 8
Type:Enzyme
Mol. Mass.:41749.60
Organism:Homo sapiens (Human)
Description:Q9BY41
Residue:377
BDBM50259807
NameBDBM50259807
Synonyms:CHEMBL4081822
TypeSmall organic molecule
Emp. Form.C28H26N2O9S
Mol. Mass.566.579
SMILESCOc1ccc2c(cn(c2c1)S(=O)(=O)c1cccc(\C=C\C(=O)NO)c1)C(=O)c1cc(OC)c(OC)c(OC)c1