Reaction Details
TargetStromelysin-2
LigandBDBM50265078
Substrate/Competitorn/a
Meas. Tech.ChEBML_1692049
Ki 149±n/a nM
Citation Rouanet-Mehouas, CCzarny, BBeau, FCassar-Lajeunesse, EStura, EADive, VDevel, L Zinc-Metalloproteinase Inhibitors: Evaluation of the Complex Role Played by the Zinc-Binding Group on Potency and Selectivity. J Med Chem60:403-414 (2017) 
 
Stromelysin-2
Name:Stromelysin-2
Type:Enzyme
Mol. Mass.:54143.02
Organism:Homo sapiens (Human)
Description:P09238
Residue:476
BDBM50265078
NameBDBM50265078
Synonyms:(4S)-5-amino-4-((2S)-2-((2S)-3-((4-bromophenyl)(hydroxy)phosphoryl)-2-((3-(3'-chlorobiphenyl-4-yl)isoxazol-5-yl)methyl)propanamido)-4-carboxybutanamido)-5-oxopentanoic acid | CHEMBL507420
TypeSmall organic molecule
Emp. Form.C35H35BrClN4O10P
Mol. Mass.818.004
SMILESNC(=O)[C@H](CCC(O)=O)NC(=O)[C@H](CCC(O)=O)NC(=O)[C@H](Cc1cc(no1)-c1ccc(cc1)-c1cccc(Cl)c1)CP(O)(=O)c1ccc(Br)cc1