Reaction Details
Target3-hydroxy-3-methylglutaryl-coenzyme A reductase
LigandBDBM50009426
Substrate/Competitorn/a
Meas. Tech.ChEBML_80659
IC50 5±n/a nM
Citation Duggan, MEAlberts, AWBostedor, RChao, YSGermershausen, JIGilfillan, JLHalczenko, WHartman, GDHunt, VImagire, JS 3-Hydroxy-3-methylglutaryl-coenzyme a reductase inhibitors. 7. Modification of the hexahydronaphthalene moiety of simvastatin: 5-oxygenated and 5-oxa derivatives. J Med Chem34:2489-95 (1991) 3-hydroxy-3-methylglutaryl-coenzyme A reductase
Name:3-hydroxy-3-methylglutaryl-coenzyme A reductase
Type:Enzyme
Mol. Mass.:96689.85
Organism:Rattus norvegicus (rat)
Description:Isolated rat liver microsomes were used as enzyme source.
Residue:887
BDBM50009426
NameBDBM50009426
Synonyms:2,2-Dimethyl-butyric acid 4-benzylcarbamoyloxy-8-[2-(4-hydroxy-6-oxo-tetrahydro-pyran-2-yl)-ethyl]-3,7-dimethyl-decahydro-naphthalen-1-yl ester | CHEMBL3349538
TypeSmall organic molecule
Emp. Form.C33H49NO7
Mol. Mass.571.7447
SMILES[H][C@@]12CC[C@H](C)[C@H](CC[C@@H]3C[C@@H](O)CC(=O)O3)C1[C@H](C[C@@H](C)[C@H]2OC(=O)NCc1ccccc1)OC(=O)C(C)(C)CC