Reaction Details
TargetRhodopsin kinase GRK1
LigandBDBM50260129
Substrate/Competitorn/a
Meas. Tech.ChEBML_1692745
IC50 24500±n/a nM
Citation Waldschmidt, HVHoman, KTCato, MCCruz-Rodríguez, OCannavo, AWilson, MWSong, JCheung, JYKoch, WJTesmer, JJLarsen, SD Structure-Based Design of Highly Selective and Potent G Protein-Coupled Receptor Kinase 2 Inhibitors Based on Paroxetine. J Med Chem60:3052-3069 (2017) 
 
Rhodopsin kinase GRK1
Name:Rhodopsin kinase GRK1
Type:PROTEIN
Mol. Mass.:62931.24
Organism:Bos taurus
Description:ChEMBL_116985
Residue:561
BDBM50260129
NameBDBM50260129
Synonyms:CHEMBL4098656
TypeSmall organic molecule
Emp. Form.C29H31FN2O4
Mol. Mass.490.5658
SMILESCc1cccc(C)c1CNC(=O)c1cc(ccc1F)[C@@H]1CCNC[C@H]1COc1ccc2OCOc2c1