Reaction Details
TargetRhodopsin kinase GRK1
LigandBDBM50260140
Substrate/Competitorn/a
Meas. Tech.ChEBML_1692745
IC50 87300±n/a nM
Citation Waldschmidt, HVHoman, KTCato, MCCruz-Rodríguez, OCannavo, AWilson, MWSong, JCheung, JYKoch, WJTesmer, JJLarsen, SD Structure-Based Design of Highly Selective and Potent G Protein-Coupled Receptor Kinase 2 Inhibitors Based on Paroxetine. J Med Chem60:3052-3069 (2017) 
 
Rhodopsin kinase GRK1
Name:Rhodopsin kinase GRK1
Type:PROTEIN
Mol. Mass.:62931.24
Organism:Bos taurus
Description:ChEMBL_116985
Residue:561
BDBM50260140
NameBDBM50260140
Synonyms:CHEMBL4090144
TypeSmall organic molecule
Emp. Form.C24H25FN4O4
Mol. Mass.452.4781
SMILESFc1ccc(cc1C(=O)NCc1ccn[nH]1)[C@@H]1CCNC[C@H]1COc1ccc2OCOc2c1