Reaction Details
TargetG protein-coupled receptor kinase 5
LigandBDBM50260130
Substrate/Competitorn/a
Meas. Tech.ChEBML_1692746
IC50 38400±n/a nM
Citation Waldschmidt, HVHoman, KTCato, MCCruz-Rodríguez, OCannavo, AWilson, MWSong, JCheung, JYKoch, WJTesmer, JJLarsen, SD Structure-Based Design of Highly Selective and Potent G Protein-Coupled Receptor Kinase 2 Inhibitors Based on Paroxetine. J Med Chem60:3052-3069 (2017) 
 
G protein-coupled receptor kinase 5
Name:G protein-coupled receptor kinase 5
Type:PROTEIN
Mol. Mass.:67903.06
Organism:Bos taurus
Description:ChEMBL_116955
Residue:590
BDBM50260130
NameBDBM50260130
Synonyms:CHEMBL4090923
TypeSmall organic molecule
Emp. Form.C29H31FN2O6
Mol. Mass.522.5646
SMILESCOc1cccc(OC)c1CNC(=O)c1cc(ccc1F)[C@@H]1CCNC[C@H]1COc1ccc2OCOc2c1