Reaction Details
TargetG protein-coupled receptor kinase 5
LigandBDBM50260135
Substrate/Competitorn/a
Meas. Tech.ChEBML_1692746
IC50>100000±n/a nM
Citation Waldschmidt, HVHoman, KTCato, MCCruz-Rodríguez, OCannavo, AWilson, MWSong, JCheung, JYKoch, WJTesmer, JJLarsen, SD Structure-Based Design of Highly Selective and Potent G Protein-Coupled Receptor Kinase 2 Inhibitors Based on Paroxetine. J Med Chem60:3052-3069 (2017) 
 
G protein-coupled receptor kinase 5
Name:G protein-coupled receptor kinase 5
Type:PROTEIN
Mol. Mass.:67903.06
Organism:Bos taurus
Description:ChEMBL_116955
Residue:590
BDBM50260135
NameBDBM50260135
Synonyms:CHEMBL4076131
TypeSmall organic molecule
Emp. Form.C27H28FN3O4
Mol. Mass.477.5273
SMILESFc1ccc(cc1C(=O)NCCc1ccccn1)[C@@H]1CCNC[C@H]1COc1ccc2OCOc2c1