Reaction Details
TargetdCTP pyrophosphatase 1
LigandBDBM50260217
Substrate/Competitorn/a
Meas. Tech.ChEBML_1693435
IC50 200±n/a nM
Citation Llona-Minguez, SHäggblad, MMartens, UJohansson, LSigmundsson, KLundbäck, TLoseva, OJemth, ASLundgren, BJensen, AJScobie, MHelleday, T Diverse heterocyclic scaffolds as dCTP pyrophosphatase 1 inhibitors. Part 2: Pyridone- and pyrimidinone-derived systems. Bioorg Med Chem Lett27:3219-3225 (2017) 
 
dCTP pyrophosphatase 1
Name:dCTP pyrophosphatase 1
Type:Protein
Mol. Mass.:18673.58
Organism:Homo sapiens (Human)
Description:Q9H773
Residue:170
BDBM50260217
NameBDBM50260217
Synonyms:CHEMBL4062129
TypeSmall organic molecule
Emp. Form.C18H19N5O2
Mol. Mass.337.3758
SMILESCc1c(C)n2c(nc3n(C)c(=O)[nH]c(=O)c23)n1Cc1ccc(C)cc1