Reaction Details
TargetdCTP pyrophosphatase 1
LigandBDBM50260234
Substrate/Competitorn/a
Meas. Tech.ChEBML_1693435
IC50 190±n/a nM
Citation Llona-Minguez, SHäggblad, MMartens, UJohansson, LSigmundsson, KLundbäck, TLoseva, OJemth, ASLundgren, BJensen, AJScobie, MHelleday, T Diverse heterocyclic scaffolds as dCTP pyrophosphatase 1 inhibitors. Part 2: Pyridone- and pyrimidinone-derived systems. Bioorg Med Chem Lett27:3219-3225 (2017) 
 
dCTP pyrophosphatase 1
Name:dCTP pyrophosphatase 1
Type:Protein
Mol. Mass.:18673.58
Organism:Homo sapiens (Human)
Description:Q9H773
Residue:170
BDBM50260234
NameBDBM50260234
Synonyms:CHEMBL4060941
TypeSmall organic molecule
Emp. Form.C17H18ClN3O
Mol. Mass.315.797
SMILESCCCc1c(C)[nH]c2c(c(C)nn2c1=O)-c1ccc(Cl)cc1