Reaction Details
TargetMu-type opioid receptor
LigandBDBM50260267
Substrate/Competitorn/a
Meas. Tech.ChEBML_1693458
Ki 5.2±n/a nM
Citation Kutsumura, NKoyama, YNagumo, YNakajima, RMiyata, YYamamoto, NSaitoh, TYoshida, NIwata, SNagase, H Antitrichomonal activity of? opioid receptor antagonists, 7-benzylidenenaltrexone derivatives. Bioorg Med Chem25:4375-4383 (2017) 
 
Mu-type opioid receptor
Name:Mu-type opioid receptor
Type:G Protein-Coupled Receptor (GPCR)
Mol. Mass.:44789.51
Organism:Homo sapiens (Human)
Description:P35372
Residue:400
BDBM50260267
NameBDBM50260267
Synonyms:CHEMBL2059382
TypeSmall organic molecule
Emp. Form.C28H29NO5
Mol. Mass.459.5336
SMILES[H][C@@]12Oc3c4c(C[C@@]5([H])N(CC6CC6)CC[C@@]14[C@@]5(O)C\C(=C/c1ccc(OC)cc1)C2=O)ccc3O