Reaction Details
TargetCarbonic anhydrase 2
LigandBDBM26985
Substrate/Competitorn/a
Meas. Tech.ChEBML_1693835
Ki 1500000±n/a nM
Citation Del Prete, SVullo, DOsman, SMAlOthman, ZDonald, WAWinum, JYSupuran, CTCapasso, C Anion inhibitors of the?-carbonic anhydrase from the pathogenic bacterium responsible of tularemia, Francisella tularensis. Bioorg Med Chem25:4800-4804 (2017) 
 
Carbonic anhydrase 2
Name:Carbonic anhydrase 2
Type:Enzyme
Mol. Mass.:29250.71
Organism:Homo sapiens (Human)
Description:P00918
Residue:260
BDBM26985
NameBDBM26985
Synonyms:2-triaza-1,2-diyne CHEMBL89295 azide
TypeIon
Emp. Form.N3
Mol. Mass.42.0206
SMILES[N-]=[N+]=[N-]