Reaction Details
TargetSodium channel protein type 5 subunit alpha
LigandBDBM50261096
Substrate/Competitorn/a
Meas. Tech.ChEMBL_1695597 (CHEMBL4046487)
IC50 37±n/a nM
Citation Wu, YJGuernon, JMcClure, ALuo, GRajamani, RNg, AEaston, ANewton, ABourin, CParker, DMosure, KBarnaby, OSoars, MGKnox, RJMatchett, MPieschl, RHerrington, JChen, PSivarao, DVBristow, LJMeanwell, NABronson, JOlson, RThompson, LADzierba, C Discovery of non-zwitterionic aryl sulfonamides as Na Bioorg Med Chem25:5490-5505 (2017) 
 
Sodium channel protein type 5 subunit alpha
Name:Sodium channel protein type 5 subunit alpha
Type:Enzyme
Mol. Mass.:226908.60
Organism:Homo sapiens (Human)
Description:Q14524
Residue:2016
BDBM50261096
NameBDBM50261096
Synonyms:CHEMBL4075332 | US10836758, Example 73
TypeSmall organic molecule
Emp. Form.C16H19ClFN3O4S3
Mol. Mass.467.986
SMILESFc1cc(NCCC2CCS(=O)(=O)CC2)c(Cl)cc1S(=O)(=O)Nc1nccs1