Reaction Details
TargetSodium channel protein type 5 subunit alpha
LigandBDBM50261147
Substrate/Competitorn/a
Meas. Tech.ChEBML_1695597
IC50 151±n/a nM
Citation Wu, YJGuernon, JMcClure, ALuo, GRajamani, RNg, AEaston, ANewton, ABourin, CParker, DMosure, KBarnaby, OSoars, MGKnox, RJMatchett, MPieschl, RHerrington, JChen, PSivarao, DVBristow, LJMeanwell, NABronson, JOlson, RThompson, LADzierba, C Discovery of non-zwitterionic aryl sulfonamides as Na Bioorg Med Chem25:5490-5505 (2017) 
 
Sodium channel protein type 5 subunit alpha
Name:Sodium channel protein type 5 subunit alpha
Type:Enzyme
Mol. Mass.:226908.60
Organism:Homo sapiens (Human)
Description:Q14524
Residue:2016
BDBM50261147
NameBDBM50261147
Synonyms:CHEMBL4094879
TypeSmall organic molecule
Emp. Form.C16H19ClFN3O3S2
Mol. Mass.419.922
SMILESO[C@@H]1CCC[C@H](CNc2cc(F)c(cc2Cl)S(=O)(=O)Nc2nccs2)C1