Reaction Details
TargetSodium channel protein type 5 subunit alpha
LigandBDBM50261120
Substrate/Competitorn/a
Meas. Tech.ChEMBL_1695598 (CHEMBL4046488)
IC50>30000±n/a nM
Citation Wu, YJGuernon, JMcClure, ALuo, GRajamani, RNg, AEaston, ANewton, ABourin, CParker, DMosure, KBarnaby, OSoars, MGKnox, RJMatchett, MPieschl, RHerrington, JChen, PSivarao, DVBristow, LJMeanwell, NABronson, JOlson, RThompson, LADzierba, C Discovery of non-zwitterionic aryl sulfonamides as Na Bioorg Med Chem25:5490-5505 (2017) 
 
Sodium channel protein type 5 subunit alpha
Name:Sodium channel protein type 5 subunit alpha
Type:Enzyme
Mol. Mass.:226908.60
Organism:Homo sapiens (Human)
Description:Q14524
Residue:2016
BDBM50261120
NameBDBM50261120
Synonyms:CHEMBL4069801
TypeSmall organic molecule
Emp. Form.C15H15ClFN3O3S2
Mol. Mass.403.879
SMILESFc1cc(NC2CC3CCC2O3)c(Cl)cc1S(=O)(=O)Nc1nccs1