Reaction Details
TargetNon-receptor tyrosine-protein kinase TYK2
LigandBDBM50261220
Substrate/Competitorn/a
Meas. Tech.ChEBML_1695702
Ki 19±n/a nM
Citation Liang, JVan Abbema, ABalazs, MBarrett, KBerezhkovsky, LBlair, WSChang, CDelarosa, DDeVoss, JDriscoll, JEigenbrot, CGoodacre, SGhilardi, NMacLeod, CJohnson, ABir Kohli, PLai, YLin, ZMantik, PMenghrajani, KNguyen, HPeng, ISambrone, AShia, SSmith, JSohn, STsui, VUltsch, MWilliams, KWu, LCYang, WZhang, BMagnuson, S Identification of an imidazopyridine scaffold to generate potent and selective TYK2 inhibitors that demonstrate activity in an in vivo psoriasis model. Bioorg Med Chem Lett27:4370-4376 (2017) 
 
Non-receptor tyrosine-protein kinase TYK2
Name:Non-receptor tyrosine-protein kinase TYK2
Type:Protein
Mol. Mass.:133666.03
Organism:Homo sapiens (Human)
Description:P29597
Residue:1187
BDBM50261220
NameBDBM50261220
Synonyms:CHEMBL4089568
TypeSmall organic molecule
Emp. Form.C17H14Cl2N4O
Mol. Mass.361.225
SMILESCn1c(nc2ccnc(NC(=O)C3CC3)c12)-c1c(Cl)cccc1Cl