Reaction Details
TargetNon-receptor tyrosine-protein kinase TYK2
LigandBDBM50261267
Substrate/Competitorn/a
Meas. Tech.ChEMBL_1695699 (CHEMBL4046589)
Ki 1.2±n/a nM
Citation Liang, JVan Abbema, ABalazs, MBarrett, KBerezhkovsky, LBlair, WSChang, CDelarosa, DDeVoss, JDriscoll, JEigenbrot, CGoodacre, SGhilardi, NMacLeod, CJohnson, ABir Kohli, PLai, YLin, ZMantik, PMenghrajani, KNguyen, HPeng, ISambrone, AShia, SSmith, JSohn, STsui, VUltsch, MWilliams, KWu, LCYang, WZhang, BMagnuson, S Identification of an imidazopyridine scaffold to generate potent and selective TYK2 inhibitors that demonstrate activity in an in vivo psoriasis model. Bioorg Med Chem Lett27:4370-4376 (2017) 
 
Non-receptor tyrosine-protein kinase TYK2
Name:Non-receptor tyrosine-protein kinase TYK2
Type:Protein
Mol. Mass.:133666.03
Organism:Homo sapiens (Human)
Description:P29597
Residue:1187
BDBM50261267
NameBDBM50261267
Synonyms:CHEMBL4097446
TypeSmall organic molecule
Emp. Form.C23H22Cl2N8O
Mol. Mass.497.38
SMILESClc1cccc(Cl)c1-c1nc2ccnc(Nc3cc(ncn3)N3CCN(CC3)C3COC3)c2[nH]1