Reaction Details
TargetTyrosine-protein kinase JAK2
LigandBDBM50261284
Substrate/Competitorn/a
Meas. Tech.ChEMBL_1695700 (CHEMBL4046590)
Ki 43±n/a nM
Citation Liang, JVan Abbema, ABalazs, MBarrett, KBerezhkovsky, LBlair, WSChang, CDelarosa, DDeVoss, JDriscoll, JEigenbrot, CGoodacre, SGhilardi, NMacLeod, CJohnson, ABir Kohli, PLai, YLin, ZMantik, PMenghrajani, KNguyen, HPeng, ISambrone, AShia, SSmith, JSohn, STsui, VUltsch, MWilliams, KWu, LCYang, WZhang, BMagnuson, S Identification of an imidazopyridine scaffold to generate potent and selective TYK2 inhibitors that demonstrate activity in an in vivo psoriasis model. Bioorg Med Chem Lett27:4370-4376 (2017) 
 
Tyrosine-protein kinase JAK2
Name:Tyrosine-protein kinase JAK2
Type:Protein
Mol. Mass.:130684.68
Organism:Homo sapiens (Human)
Description:O60674
Residue:1132
BDBM50261284
NameBDBM50261284
Synonyms:CHEMBL4065419
TypeSmall organic molecule
Emp. Form.C19H17Cl2N7
Mol. Mass.414.291
SMILESCN(C)c1cc(Nc2nccc3nc([nH]c23)-c2c(Cl)cccc2Cl)nc(C)n1