Reaction Details
TargetExtracellular calcium-sensing receptor
LigandBDBM50261666
Substrate/Competitorn/a
Meas. Tech.ChEBML_1696272
EC50 16±n/a nM
Citation Sparks, SMSpearing, PKDiaz, CJCowan, DJJayawickreme, CChen, GRimele, TJGeneraux, CHarston, LTRoller, SG Identification of potent, nonabsorbable agonists of the calcium-sensing receptor for GI-specific administration. Bioorg Med Chem Lett27:4673-4677 (2017) 
 
Extracellular calcium-sensing receptor
Name:Extracellular calcium-sensing receptor
Type:Protein
Mol. Mass.:120663.13
Organism:Homo sapiens (Human)
Description:P41180
Residue:1078
BDBM50261666
NameBDBM50261666
Synonyms:CHEMBL4100132
TypeSmall organic molecule
Emp. Form.C31H42N4O4
Mol. Mass.534.6896
SMILESC[C@@H](N[C@H]1CCN(C1)c1ccc(cc1)C(=O)NCCCCNC(CO)(CO)CO)c1cccc2ccccc12