Reaction Details
TargetExtracellular calcium-sensing receptor
LigandBDBM50261691
Substrate/Competitorn/a
Meas. Tech.ChEBML_1696272
EC50 40±n/a nM
Citation Sparks, SMSpearing, PKDiaz, CJCowan, DJJayawickreme, CChen, GRimele, TJGeneraux, CHarston, LTRoller, SG Identification of potent, nonabsorbable agonists of the calcium-sensing receptor for GI-specific administration. Bioorg Med Chem Lett27:4673-4677 (2017) 
 
Extracellular calcium-sensing receptor
Name:Extracellular calcium-sensing receptor
Type:Protein
Mol. Mass.:120663.13
Organism:Homo sapiens (Human)
Description:P41180
Residue:1078
BDBM50261691
NameBDBM50261691
Synonyms:CHEMBL4094738
TypeSmall organic molecule
Emp. Form.C24H27N3O4S
Mol. Mass.453.554
SMILESC[C@@H](N[C@H]1CCN(C1)c1ccc(cc1)S(=O)(=O)NCC(O)=O)c1cccc2ccccc12