Reaction Details
TargetBroad substrate specificity ATP-binding cassette transporter ABCG2
LigandBDBM50261736
Substrate/Competitorn/a
Meas. Tech.ChEMBL_1696291 (CHEMBL4047181)
IC50 283±n/a nM
Citation Gujarati, NAZeng, LGupta, PChen, ZSKorlipara, VL Design, synthesis and biological evaluation of benzamide and phenyltetrazole derivatives with amide and urea linkers as BCRP inhibitors. Bioorg Med Chem Lett27:4698-4704 (2017) 
 
Broad substrate specificity ATP-binding cassette transporter ABCG2
Name:Broad substrate specificity ATP-binding cassette transporter ABCG2
Type:Multi-pass membrane protein; monomer or homodimer; disulfide-linked
Mol. Mass.:72329.48
Organism:Homo sapiens (Human)
Description:Q9UNQ0
Residue:655
BDBM50261736
NameBDBM50261736
Synonyms:CHEMBL4091036
TypeSmall organic molecule
Emp. Form.C23H19BrN6O3
Mol. Mass.507.339
SMILESCOc1cccc(c1)-n1nnc(n1)-c1ccccc1NC(=O)c1ccc(NC(=O)CBr)cc1