Reaction Details
TargetLysine-specific histone demethylase 1A
LigandBDBM50262048
Substrate/Competitorn/a
Meas. Tech.ChEBML_1696557
IC50 41±n/a nM
Citation Mould, DPBremberg, UJordan, AMGeitmann, MMcGonagle, AESomervaille, TCPSpencer, GJOgilvie, DJ Development and evaluation of 4-(pyrrolidin-3-yl)benzonitrile derivatives as inhibitors of lysine specific demethylase 1. Bioorg Med Chem Lett27:4755-4759 (2017) 
 
Lysine-specific histone demethylase 1A
Name:Lysine-specific histone demethylase 1A
Type:Enzyme
Mol. Mass.:92901.01
Organism:Homo sapiens (Human)
Description:O60341
Residue:852
BDBM50262048
NameBDBM50262048
Synonyms:CHEMBL3134377
TypeSmall organic molecule
Emp. Form.C24H23N3O
Mol. Mass.369.4589
SMILESCc1ccc(cc1)-c1ncc(OC[C@@H]2CCNC2)cc1-c1ccc(cc1)C#N