Reaction Details
TargetDelta-type opioid receptor/Kappa-type opioid receptor/Mu-type opioid receptor/Sigma non-opioid intracellular receptor 1
LigandBDBM50002184
Substrate/Competitorn/a
Meas. Tech.ChEMBL_147494 (CHEMBL754241)
IC50 7.8±n/a nM
Citation Kawasaki, AMKnapp, RJKramer, THWire, WSVasquez, OSYamamura, HIBurks, TFHruby, VJ Design and synthesis of highly potent and selective cyclic dynorphin A analogues. J Med Chem33:1874-9 (1990) Delta-type opioid receptor/Kappa-type opioid receptor/Mu-type opioid receptor/Sigma non-opioid intracellular receptor 1
Name:Delta-type opioid receptor/Kappa-type opioid receptor/Mu-type opioid receptor/Sigma non-opioid intracellular receptor 1
Synonyms:Opioid receptor
Type:n/a
Mol. Mass.:n/a
Description:ASSAY_ID of ChEMBL is 146137
Components:This complex has 4 components.
Component 1
Name:Sigma non-opioid intracellular receptor 1
Type:Enzyme Catalytic Domain
Mol. Mass.:25246.51
Organism:Mus musculus (Mouse)
Description:O55242
Residue:223
Component 2
Name:Mu-type opioid receptor
Synonyms:M-OR-1 Mor OPRM_MOUSE Oprm | Oprm1
Type:Enzyme Catalytic Domain
Mol. Mass.:44431.62
Organism:MOUSE
Description:OPIATE Mu OPRM1 MOUSE::P42866
Residue:398
Component 3
Name:Kappa-type opioid receptor
Synonyms:KOR-1 OPIATE Kappa Oprk1
Type:Enzyme
Mol. Mass.:42656.78
Organism:Mus musculus (Mouse)
Description:P33534
Residue:380
Component 4
Name:Delta-type opioid receptor
Synonyms:DOR-1 MSL-2 OPRD_MOUSE Oprd1
Type:Enzyme Catalytic Domain
Mol. Mass.:40577.25
Organism:MOUSE
Description:P32300
Residue:372
BDBM50002184
NameBDBM50002184
Synonyms:CHEMBL415330 Linear Dyn A-(1-13)NH2 Tyr-Gly-Gly-Phe-Leu-Arg-Arg-Ile-Arg-Pro-Lys-Leu-Lys-NH2
TypeSmall organic molecule
Emp. Form.C75H127N25O14
Mol. Mass.1602.97
SMILESCC[C@H](C)[C@H](NC(=O)[C@H](CCCNC(N)=N)NC(=O)[C@H](CCCNC(N)=N)NC(=O)[C@H](CC(C)C)NC(=O)[C@H](Cc1ccccc1)NC(=O)CNC(=O)CNC(=O)[C@@H](N)Cc1ccc(O)cc1)C(=O)N[C@@H](CCCNC(N)=N)C(=O)N1CCC[C@H]1C(=O)N[C@@H](CCCCN)C(=O)N[C@@H](CC(C)C)C(=O)N[C@@H](CCCCN)C(N)=O