Reaction Details
TargetDelta-type opioid receptor/Kappa-type opioid receptor/Mu-type opioid receptor/Sigma non-opioid intracellular receptor 1
LigandBDBM50010701
Substrate/Competitorn/a
Meas. Tech.ChEMBL_147494 (CHEMBL754241)
IC50 20±n/a nM
Citation Kawasaki, AMKnapp, RJKramer, THWire, WSVasquez, OSYamamura, HIBurks, TFHruby, VJ Design and synthesis of highly potent and selective cyclic dynorphin A analogues. J Med Chem33:1874-9 (1990) Delta-type opioid receptor/Kappa-type opioid receptor/Mu-type opioid receptor/Sigma non-opioid intracellular receptor 1
Name:Delta-type opioid receptor/Kappa-type opioid receptor/Mu-type opioid receptor/Sigma non-opioid intracellular receptor 1
Synonyms:Opioid receptor
Type:n/a
Mol. Mass.:n/a
Description:ASSAY_ID of ChEMBL is 146137
Components:This complex has 4 components.
Component 1
Name:Sigma non-opioid intracellular receptor 1
Type:Enzyme Catalytic Domain
Mol. Mass.:25246.51
Organism:Mus musculus (Mouse)
Description:O55242
Residue:223
Component 2
Name:Mu-type opioid receptor
Synonyms:M-OR-1 Mor OPRM_MOUSE Oprm | Oprm1
Type:Enzyme Catalytic Domain
Mol. Mass.:44431.62
Organism:MOUSE
Description:OPIATE Mu OPRM1 MOUSE::P42866
Residue:398
Component 3
Name:Kappa-type opioid receptor
Synonyms:KOR-1 OPIATE Kappa Oprk1
Type:Enzyme
Mol. Mass.:42656.78
Organism:Mus musculus (Mouse)
Description:P33534
Residue:380
Component 4
Name:Delta-type opioid receptor
Synonyms:DOR-1 MSL-2 OPRD_MOUSE Oprd1
Type:Enzyme Catalytic Domain
Mol. Mass.:40577.25
Organism:MOUSE
Description:P32300
Residue:372
BDBM50010701
NameBDBM50010701
Synonyms:CHEMBL410616 | H-Tyr-Gly-Gly-Phe-Leu-Arg-Arg-D-Cys-Arg-Pro-Lys-Leu-D-Cys-NH2
TypeSmall organic molecule
Emp. Form.C69H112N24O14S2
Mol. Mass.1565.91
SMILESCC(C)C[C@H](NC(=O)[C@H](Cc1ccccc1)NC(=O)CNC(=O)CNC(=O)[C@@H](N)Cc1ccc(O)cc1)C(=O)N[C@@H](CCCNC(N)=N)C(=O)N[C@@H](CCCNC(N)=N)C(=O)N[C@@H]1CSSC[C@@H](NC(=O)[C@H](CC(C)C)NC(=O)[C@H](CCCCN)NC(=O)[C@@H]2CCCN2C(=O)[C@H](CCCNC(N)=N)NC1=O)C(N)=O