Reaction Details
TargetPlatelet-activating factor receptor
LigandBDBM50005232
Substrate/Competitorn/a
Meas. Tech.ChEBML_177423
IC50 12±n/a nM
Citation Bartrolí, JCarceller, EMerlos, MGarcía-Rafanell, JForn, J Disubstituted tetrahydrofurans and dioxolanes and PAF antagonists. J Med Chem34:373-86 (1991) Platelet-activating factor receptor
Name:Platelet-activating factor receptor
Type:Protein
Mol. Mass.:39005.63
Organism:Cavia porcellus
Description:n/a
Residue:342
BDBM50005232
NameBDBM50005232
Synonyms:(R)-2-{[Acetyl-(2-methoxy-3-octadecylcarbamoyloxy-propoxycarbonyl)-amino]-methyl}-1-ethyl-pyridinium; chloride 2-{[Acetyl-(2-methoxy-3-octadecylcarbamoyloxy-propoxycarbonyl)-amino]-methyl}-1-ethyl-pyridinium; chloride CHEMBL274420 | CV-6209
TypeSmall organic molecule
Emp. Form.C34H60N3O6
Mol. Mass.606.8562
(=O)OCC(COC(=O)N(Cc1cccc[n+]1CC)C(C)=O)OC