Reaction Details
TargetC-X-C chemokine receptor type 4
LigandBDBM50263976
Substrate/Competitorn/a
Meas. Tech.ChEMBL_1698355 (CHEMBL4049245)
IC50>30000±n/a nM
Citation Sekiguchi, HKuroyanagi, TRhainds, DKobayashi, KKobayashi, YOhno, HHeveker, NAkaji, KFujii, NOishi, S Structure-Activity Relationship Study of Cyclic Pentapeptide Ligands for Atypical Chemokine Receptor 3 (ACKR3). J Med Chem61:3745-3751 (2018) 
 
C-X-C chemokine receptor type 4
Name:C-X-C chemokine receptor type 4
Type:Enzyme
Mol. Mass.:39754.61
Organism:Homo sapiens (Human)
Description:P61073
Residue:352
BDBM50263976
NameBDBM50263976
Synonyms:CHEMBL4063107
TypeSmall organic molecule
Emp. Form.C39H51N9O6
Mol. Mass.741.8789
SMILES[H][C@@]12CCCN1C(=O)[C@H](Cc1ccc3ccccc3c1)NC(=O)[C@H](CCCN)N(C)C(=O)[C@H](CCCNC(N)=N)NC(=O)[C@@H](Cc1ccc(O)cc1)NC2=O