Reaction Details
TargetAtypical chemokine receptor 3
LigandBDBM50264057
Substrate/Competitorn/a
Meas. Tech.ChEMBL_1698353 (CHEMBL4049243)
IC50 410±n/a nM
Citation Sekiguchi, HKuroyanagi, TRhainds, DKobayashi, KKobayashi, YOhno, HHeveker, NAkaji, KFujii, NOishi, S Structure-Activity Relationship Study of Cyclic Pentapeptide Ligands for Atypical Chemokine Receptor 3 (ACKR3). J Med Chem61:3745-3751 (2018) 
 
Atypical chemokine receptor 3
Name:Atypical chemokine receptor 3
Type:Enzyme
Mol. Mass.:41498.84
Organism:Homo sapiens (Human)
Description:P25106
Residue:362
BDBM50264057
NameBDBM50264057
Synonyms:CHEMBL4083207
TypeSmall organic molecule
Emp. Form.C40H51FN10O6
Mol. Mass.786.8947
SMILES[H][C@@]12CCCN1C(=O)[C@H](Cc1ccc3ccccc3c1)NC(=O)[C@H](CCCNC(N)=O)N(C)C(=O)[C@H](CCCNC(N)=N)NC(=O)[C@@H](Cc1ccccc1F)NC2=O