Reaction Details
TargetAtypical chemokine receptor 3
LigandBDBM50264002
Substrate/Competitorn/a
Meas. Tech.ChEMBL_1698353 (CHEMBL4049243)
IC50 1800±n/a nM
Citation Sekiguchi, HKuroyanagi, TRhainds, DKobayashi, KKobayashi, YOhno, HHeveker, NAkaji, KFujii, NOishi, S Structure-Activity Relationship Study of Cyclic Pentapeptide Ligands for Atypical Chemokine Receptor 3 (ACKR3). J Med Chem61:3745-3751 (2018) 
 
Atypical chemokine receptor 3
Name:Atypical chemokine receptor 3
Type:Enzyme
Mol. Mass.:41498.84
Organism:Homo sapiens (Human)
Description:P25106
Residue:362
BDBM50264002
NameBDBM50264002
Synonyms:CHEMBL4072634
TypeSmall organic molecule
Emp. Form.C45H56N10O8
Mol. Mass.864.9883
SMILESCN1[C@@H](CCCNC(N)=O)C(=O)N[C@@H](Cc2ccc3ccccc3c2)C(=O)N(C)[C@@H](Cc2ccc(O)cc2)C(=O)N[C@H](Cc2ccc(O)cc2)C(=O)N[C@@H](CCCNC(N)=N)C1=O