Reaction Details
TargetNuclear receptor subfamily 1 group I member 2
LigandBDBM50264804
Substrate/Competitorn/a
Meas. Tech.ChEMBL_1699179 (CHEMBL4050161)
IC50>30000±n/a nM
Citation Cernak, TGesmundo, NJDykstra, KYu, YWu, ZShi, ZCVachal, PSperbeck, DHe, SMurphy, BASonatore, LWilliams, SMadeira, MVerras, AReiter, MLee, CHCuff, JSherer, ECKuethe, JGoble, SPerrotto, NPinto, SShen, DMNargund, RBalkovec, JDeVita, RJDreher, SD Microscale High-Throughput Experimentation as an Enabling Technology in Drug Discovery: Application in the Discovery of (Piperidinyl)pyridinyl-1H-benzimidazole Diacylglycerol Acyltransferase 1 Inhibitors. J Med Chem60:3594-3605 (2017) 
 
Nuclear receptor subfamily 1 group I member 2
Name:Nuclear receptor subfamily 1 group I member 2
Type:Nuclear receptor
Mol. Mass.:49774.77
Organism:Homo sapiens (Human)
Description:O75469
Residue:434
BDBM50264804
NameBDBM50264804
Synonyms:CHEMBL4060355
TypeSmall organic molecule
Emp. Form.C24H25F3N4O3
Mol. Mass.474.4755
SMILESOC(=O)CC1CCC2(CCN(CC2)c2ccc(cn2)-c2nc3cc(ccc3[nH]2)C(F)(F)F)OC1