Reaction Details
TargetDiacylglycerol O-acyltransferase 1
LigandBDBM50264822
Substrate/Competitorn/a
Meas. Tech.ChEMBL_1699174 (CHEMBL4050156)
IC50 3.0±n/a nM
Citation Cernak, TGesmundo, NJDykstra, KYu, YWu, ZShi, ZCVachal, PSperbeck, DHe, SMurphy, BASonatore, LWilliams, SMadeira, MVerras, AReiter, MLee, CHCuff, JSherer, ECKuethe, JGoble, SPerrotto, NPinto, SShen, DMNargund, RBalkovec, JDeVita, RJDreher, SD Microscale High-Throughput Experimentation as an Enabling Technology in Drug Discovery: Application in the Discovery of (Piperidinyl)pyridinyl-1H-benzimidazole Diacylglycerol Acyltransferase 1 Inhibitors. J Med Chem60:3594-3605 (2017) 
 
Diacylglycerol O-acyltransferase 1
Name:Diacylglycerol O-acyltransferase 1
Type:Protein
Mol. Mass.:55297.82
Organism:Homo sapiens (Human)
Description:O75907
Residue:488
BDBM50264822
NameBDBM50264822
Synonyms:CHEMBL4091946
TypeSmall organic molecule
Emp. Form.C26H19F3N4O4
Mol. Mass.508.4487
SMILESOC(=O)c1ccc2c(c1)C(=O)OC21CCN(CC1)c1ccc(cn1)-c1nc2cc(ccc2[nH]1)C(F)(F)F