Reaction Details
TargetKynurenine 3-monooxygenase
LigandBDBM50266002
Substrate/Competitorn/a
Meas. Tech.ChEBML_1700450
IC50 3.2±n/a nM
Citation Walker, ALAncellin, NBeaufils, BBergeal, MBinnie, MBouillot, AClapham, DDenis, AHaslam, CPHolmes, DSHutchinson, JPLiddle, JMcBride, AMirguet, OMowat, CGRowland, PTiberghien, NTrottet, LUings, IWebster, SPZheng, XMole, DJ Development of a Series of Kynurenine 3-Monooxygenase Inhibitors Leading to a Clinical Candidate for the Treatment of Acute Pancreatitis. J Med Chem60:3383-3404 (2017) 
 
Kynurenine 3-monooxygenase
Name:Kynurenine 3-monooxygenase
Type:PROTEIN
Mol. Mass.:55831.03
Organism:Homo sapiens (Human)
Description:ChEMBL_1487479
Residue:486
BDBM50266002
NameBDBM50266002
Synonyms:CHEMBL4081917
TypeSmall organic molecule
Emp. Form.C17H16ClN3O4
Mol. Mass.361.78
SMILESC[C@@H](Oc1cc2onc(CCC(O)=O)c2cc1Cl)c1ccc(C)nn1