Reaction Details
TargetKynurenine 3-monooxygenase
LigandBDBM50266005
Substrate/Competitorn/a
Meas. Tech.ChEBML_1700450
IC50 1580±n/a nM
Citation Walker, ALAncellin, NBeaufils, BBergeal, MBinnie, MBouillot, AClapham, DDenis, AHaslam, CPHolmes, DSHutchinson, JPLiddle, JMcBride, AMirguet, OMowat, CGRowland, PTiberghien, NTrottet, LUings, IWebster, SPZheng, XMole, DJ Development of a Series of Kynurenine 3-Monooxygenase Inhibitors Leading to a Clinical Candidate for the Treatment of Acute Pancreatitis. J Med Chem60:3383-3404 (2017) 
 
Kynurenine 3-monooxygenase
Name:Kynurenine 3-monooxygenase
Type:PROTEIN
Mol. Mass.:55831.03
Organism:Homo sapiens (Human)
Description:ChEMBL_1487479
Residue:486
BDBM50266005
NameBDBM50266005
Synonyms:CHEMBL4079327
TypeSmall organic molecule
Emp. Form.C18H25ClN2O8
Mol. Mass.432.853
SMILESNC(CO)(CO)CO.OC(=O)CCn1c2cc(Cl)c(OCC3CC3)cc2oc1=O