Reaction Details
TargetKynurenine 3-monooxygenase
LigandBDBM50266041
Substrate/Competitorn/a
Meas. Tech.ChEMBL_1700498 (CHEMBL4051480)
IC50 3.2±n/a nM
Citation Walker, ALAncellin, NBeaufils, BBergeal, MBinnie, MBouillot, AClapham, DDenis, AHaslam, CPHolmes, DSHutchinson, JPLiddle, JMcBride, AMirguet, OMowat, CGRowland, PTiberghien, NTrottet, LUings, IWebster, SPZheng, XMole, DJ Development of a Series of Kynurenine 3-Monooxygenase Inhibitors Leading to a Clinical Candidate for the Treatment of Acute Pancreatitis. J Med Chem60:3383-3404 (2017) 
 
Kynurenine 3-monooxygenase
Name:Kynurenine 3-monooxygenase
Type:PROTEIN
Mol. Mass.:50713.22
Organism:Pseudomonas fluorescens
Description:ChEMBL_117445
Residue:461
BDBM50266041
NameBDBM50266041
Synonyms:CHEMBL4070212
TypeSmall organic molecule
Emp. Form.C17H15ClN2O5
Mol. Mass.362.764
SMILESC[C@@H](Oc1cc2oc(=O)n(CCC(O)=O)c2cc1Cl)c1ccccn1