Reaction Details
TargetPlatelet-activating factor receptor
LigandBDBM50011632
Substrate/Competitorn/a
Meas. Tech.ChEBML_56498
IC50 5±n/a nM
Citation Walser, AFlynn, TMason, CCrowley, HMaresca, CYaremko, BO'Donnell, M Triazolobenzo- and triazolothienodiazepines as potent antagonists of platelet activating factor. J Med Chem34:1209-21 (1991) Platelet-activating factor receptor
Name:Platelet-activating factor receptor
Type:Enzyme Catalytic Domain
Mol. Mass.:39219.60
Organism:Homo sapiens (Human)
Description:PAF Platelet activating factor PTAFR HUMAN::P25105
Residue:342
BDBM50011632
NameBDBM50011632
Synonyms:4-{3-[6-(2-Fluoro-phenyl)-1-methyl-4H-2,3,5,10b-tetraaza-benzo[e]azulen-8-yl]-prop-2-ynyl}-4H-benzo[1,4]oxazin-3-one | CHEMBL19947
TypeSmall organic molecule
Emp. Form.C28H20FN5O2
Mol. Mass.477.4891
SMILESCc1nnc2CN=C(c3ccccc3F)c3cc(ccc3-n12)C#CCN1C(=O)COc2ccccc12