Reaction Details
TargetPlatelet-activating factor receptor
LigandBDBM50011649
Substrate/Competitorn/a
Meas. Tech.ChEBML_56498
IC50 4±n/a nM
Citation Walser, AFlynn, TMason, CCrowley, HMaresca, CYaremko, BO'Donnell, M Triazolobenzo- and triazolothienodiazepines as potent antagonists of platelet activating factor. J Med Chem34:1209-21 (1991) Platelet-activating factor receptor
Name:Platelet-activating factor receptor
Type:Enzyme Catalytic Domain
Mol. Mass.:39219.60
Organism:Homo sapiens (Human)
Description:PAF Platelet activating factor PTAFR HUMAN::P25105
Residue:342
BDBM50011649
NameBDBM50011649
Synonyms:4-{3-[4-(2-Chloro-phenyl)-9-methyl-6H-1-thia-5,7,8,9a-tetraaza-cyclopenta[e]azulen-2-yl]-prop-2-ynyl}-7-fluoro-4H-benzo[1,4]oxazin-3-one | CHEMBL20418
TypeSmall organic molecule
Emp. Form.C26H17ClFN5O2S
Mol. Mass.517.962
SMILESCc1nnc2CN=C(c3cc(sc3-n12)C#CCN1C(=O)COc2cc(F)ccc12)c1ccccc1Cl