Reaction Details
TargetPlatelet-activating factor receptor
LigandBDBM50011663
Substrate/Competitorn/a
Meas. Tech.ChEBML_56498
IC50 3±n/a nM
Citation Walser, AFlynn, TMason, CCrowley, HMaresca, CYaremko, BO'Donnell, M Triazolobenzo- and triazolothienodiazepines as potent antagonists of platelet activating factor. J Med Chem34:1209-21 (1991) Platelet-activating factor receptor
Name:Platelet-activating factor receptor
Type:Enzyme Catalytic Domain
Mol. Mass.:39219.60
Organism:Homo sapiens (Human)
Description:PAF Platelet activating factor PTAFR HUMAN::P25105
Residue:342
BDBM50011663
NameBDBM50011663
Synonyms:1-{3-[4-(2-Chloro-phenyl)-9-methyl-6H-1-thia-5,7,8,9a-tetraaza-cyclopenta[e]azulen-2-yl]-prop-2-ynyl}-1,3-dihydro-indol-2-one | CHEMBL429066
TypeSmall organic molecule
Emp. Form.C26H18ClN5OS
Mol. Mass.483.972
SMILESCc1nnc2CN=C(c3cc(sc3-n12)C#CCN1C(=O)Cc2ccccc12)c1ccccc1Cl