Reaction Details
TargetATPase family AAA domain-containing protein 2B
LigandBDBM50249797
Substrate/Competitorn/a
Meas. Tech.ChEMBL_1701779 (CHEMBL4053012)
IC50>100000±n/a nM
Citation Igoe, NBayle, EDFedorov, OTallant, CSavitsky, PRogers, COwen, DRDeb, GSomervaille, TCAndrews, DMJones, NCheasty, ARyder, HBrennan, PEMüller, SKnapp, SFish, PV Design of a Biased Potent Small Molecule Inhibitor of the Bromodomain and PHD Finger-Containing (BRPF) Proteins Suitable for Cellular and in Vivo Studies. J Med Chem60:668-680 (2017) 
 
ATPase family AAA domain-containing protein 2B
Name:ATPase family AAA domain-containing protein 2B
Type:PROTEIN
Mol. Mass.:164918.65
Organism:Homo sapiens (Human)
Description:ChEMBL_105350
Residue:1458
BDBM50249797
NameBDBM50249797
Synonyms:CHEMBL4059509
TypeSmall organic molecule
Emp. Form.C20H19N3O3S
Mol. Mass.381.448
SMILESCCc1cc2cc(NS(=O)(=O)c3ccc(cc3)C#N)ccc2n(CC)c1=O