Reaction Details
TargetAromatase
LigandBDBM50011770
Substrate/Competitorn/a
Meas. Tech.ChEBML_51027
Ki 75±n/a nM
Citation Childers, WESilverton, JVKellis, JTVickery, LERobinson, CH Inhibition of human placental aromatase by novel homologated 19-oxiranyl and 19-thiiranyl steroids. J Med Chem34:1344-9 (1991) Aromatase
Name:Aromatase
Type:Enzyme
Mol. Mass.:57888.92
Organism:Homo sapiens (Human)
Description:P11511
Residue:503
BDBM50011770
NameBDBM50011770
Synonyms:13-Methyl-10-thiiranyl-1,6,7,8,9,10,11,12,13,14,15,16-dodecahydro-2H-cyclopenta[a]phenanthrene-3,17-dione | CHEMBL282580
TypeSmall organic molecule
Emp. Form.C20H26O2S
Mol. Mass.330.484
SMILESC[C@]12CCC3C(CCC4=CC(=O)CC[C@]34C3CS3)C1CCC2=O