Reaction Details
TargetAromatase
LigandBDBM50406525
Substrate/Competitorn/a
Meas. Tech.ChEBML_51027
Ki 22±n/a nM
Citation Childers, WESilverton, JVKellis, JTVickery, LERobinson, CH Inhibition of human placental aromatase by novel homologated 19-oxiranyl and 19-thiiranyl steroids. J Med Chem34:1344-9 (1991) Aromatase
Name:Aromatase
Type:Enzyme
Mol. Mass.:57888.92
Organism:Homo sapiens (Human)
Description:P11511
Residue:503
BDBM50406525
NameBDBM50406525
Synonyms:CHEMBL2113272
TypeSmall organic molecule
Emp. Form.C21H28O2S
Mol. Mass.344.511
SMILESC[C@]12CC[C@H]3[C@@H](CCC4=CC(=O)CC[C@]34C[C@H]3CS3)[C@@H]1CCC2=O