Reaction Details
TargetPlatelet-activating factor receptor
LigandBDBM50011856
Substrate/Competitorn/a
Meas. Tech.ChEBML_154999
IC50 1000±n/a nM
Citation Walser, AFlynn, TMason, CCrowley, HMaresca, CO'Donnell, M Thienotriazolodiazepines as platelet-activating factor antagonists. Steric limitations for the substituent in position 2. J Med Chem34:1440-6 (1991) Platelet-activating factor receptor
Name:Platelet-activating factor receptor
Type:Enzyme Catalytic Domain
Mol. Mass.:39219.60
Organism:Homo sapiens (Human)
Description:PAF Platelet activating factor PTAFR HUMAN::P25105
Residue:342
BDBM50011856
NameBDBM50011856
Synonyms:CHEMBL33217 | {5-[4-(2-Chloro-phenyl)-9-methyl-6H-1-thia-5,7,8,9a-tetraaza-cyclopenta[e]azulen-2-yl]-3H-[1,2,3]triazol-4-yl}-morpholin-4-yl-methanone
TypeSmall organic molecule
Emp. Form.C22H19ClN8O2S
Mol. Mass.494.957
SMILESCc1nnc2CN=C(c3cc(sc3-n12)-c1nn[nH]c1C(=O)N1CCOCC1)c1ccccc1Cl