Reaction Details
TargetPlatelet-activating factor receptor
LigandBDBM50011867
Substrate/Competitorn/a
Meas. Tech.ChEBML_154999
IC50 400±n/a nM
Citation Walser, AFlynn, TMason, CCrowley, HMaresca, CO'Donnell, M Thienotriazolodiazepines as platelet-activating factor antagonists. Steric limitations for the substituent in position 2. J Med Chem34:1440-6 (1991) Platelet-activating factor receptor
Name:Platelet-activating factor receptor
Type:Enzyme Catalytic Domain
Mol. Mass.:39219.60
Organism:Homo sapiens (Human)
Description:PAF Platelet activating factor PTAFR HUMAN::P25105
Residue:342
BDBM50011867
NameBDBM50011867
Synonyms:4-(2-Chloro-phenyl)-9-methyl-2-(2,2,7-trimethyl-2,3-dihydro-benzofuran-5-ylethynyl)-6H-1-thia-5,7,8,9a-tetraaza-cyclopenta[e]azulene | CHEMBL32932
TypeSmall organic molecule
Emp. Form.C28H23ClN4OS
Mol. Mass.499.026
SMILESCc1nnc2CN=C(c3cc(sc3-n12)C#Cc1cc2CC(C)(C)Oc2c(C)c1)c1ccccc1Cl