Reaction Details
TargetPepsin A
LigandBDBM50012626
Substrate/Competitorn/a
Meas. Tech.ChEMBL_153978 (CHEMBL762330)
IC50 10±n/a nM
Citation McConnell, RMFrizzell, DCamp, AEvans, AJones, WCagle, C New pepstatin analogues: synthesis and pepsin inhibition. J Med Chem34:2298-300 (1991) Pepsin A
Name:Pepsin A
Type:Enzyme
Mol. Mass.:41232.87
Organism:Porcine
Description:n/a
Residue:385
BDBM50012626
NameBDBM50012626
Synonyms:3-hydroxy-4-[2-methyl-1-[2-methyl-1-benzyloxycarboxamido-(1S)-propylcarboxamido]-(1S)-propylcarboxamido]octanoic acid | CHEMBL72555
TypeSmall organic molecule
Emp. Form.C26H41N3O7
Mol. Mass.507.6196
SMILESCCCCC(NC(=O)[C@@H](NC(=O)[C@@H](NC(=O)OCc1ccccc1)C(C)C)C(C)C)C(O)CC(O)=O