Reaction Details
TargetdCTP pyrophosphatase 1
LigandBDBM50236118
Substrate/Competitorn/a
Meas. Tech.ChEMBL_1705780 (CHEMBL4057013)
IC50 20±n/a nM
Citation Llona-Minguez, SHäggblad, MMartens, UThroup, ALoseva, OJemth, ASLundgren, BScobie, MHelleday, T Diverse heterocyclic scaffolds as dCTP pyrophosphatase 1 inhibitors. Part 1: Triazoles, triazolopyrimidines, triazinoindoles, quinoline hydrazones and arylpiperazines. Bioorg Med Chem Lett27:3897-3904 (2017) 
 
dCTP pyrophosphatase 1
Name:dCTP pyrophosphatase 1
Type:Protein
Mol. Mass.:18673.58
Organism:Homo sapiens (Human)
Description:Q9H773
Residue:170
BDBM50236118
NameBDBM50236118
Synonyms:CHEMBL4065181
TypeSmall organic molecule
Emp. Form.C15H12N4O2S2
Mol. Mass.344.411
SMILESCOc1ccc(cc1OC)-c1nn2c(nnc2s1)-c1cccs1