Reaction Details
TargetdCTP pyrophosphatase 1
LigandBDBM50150052
Substrate/Competitorn/a
Meas. Tech.ChEMBL_1705780 (CHEMBL4057013)
IC50 47±n/a nM
Citation Llona-Minguez, SHäggblad, MMartens, UThroup, ALoseva, OJemth, ASLundgren, BScobie, MHelleday, T Diverse heterocyclic scaffolds as dCTP pyrophosphatase 1 inhibitors. Part 1: Triazoles, triazolopyrimidines, triazinoindoles, quinoline hydrazones and arylpiperazines. Bioorg Med Chem Lett27:3897-3904 (2017) 
 
dCTP pyrophosphatase 1
Name:dCTP pyrophosphatase 1
Type:Protein
Mol. Mass.:18673.58
Organism:Homo sapiens (Human)
Description:Q9H773
Residue:170
BDBM50150052
NameBDBM50150052
Synonyms:CHEMBL3771105
TypeSmall organic molecule
Emp. Form.C20H17BCl2N4O6
Mol. Mass.491.089
SMILESCN1CC(=O)OB(OC(=O)C1)c1ccc(Cn2c(C)nc3c(c(Cl)c(Cl)cc23)[N+]([O-])=O)cc1