Reaction Details
TargetCysteine protease
LigandBDBM8964
Substrate/Competitorn/a
Meas. Tech.ChEMBL_1705909 (CHEMBL4057142)
IC50 16900±n/a nM
Citation Schmidt, IGöllner, SFuß, AStich, AKucharski, ASchirmeister, TKatzowitsch, EBruhn, HMiliu, AKrauth-Siegel, RLHolzgrabe, U Bistacrines as potential antitrypanosomal agents. Bioorg Med Chem25:4526-4531 (2017) 
 
Cysteine protease
Name:Cysteine protease
Synonyms:Rhodesain
Type:PROTEIN
Mol. Mass.:48425.78
Organism:Trypanosoma brucei rhodesiense
Description:ChEMBL_619861
Residue:450
BDBM8964
NameBDBM8964
TypeSmall organic molecule
Emp. Form.C34H42N4
Mol. Mass.506.7241
SMILESC(CCCCNc1c2CCCCc2nc2ccccc12)CCCNc1c2CCCCc2nc2ccccc12