Reaction Details
TargetRenin
LigandBDBM50012938
Substrate/Competitorn/a
Meas. Tech.ChEBML_195780
IC50 0.300000±n/a nM
Citation Bradbury, RHMajor, JSOldham, AARivett, JERoberts, DASlater, AMTimms, DWaterson, D 1,2,4-Triazolo[4,3-a]pyrazine derivatives with human renin inhibitory activity. 2. Synthesis, biological properties and molecular modeling of hydroxyethylene isostere derivatives. J Med Chem33:2335-42 (1990) Renin
Name:Renin
Type:Enzyme
Mol. Mass.:45058.99
Organism:Homo sapiens (Human)
Description:n/a
Residue:406
BDBM50012938
NameBDBM50012938
Synonyms:6-Cyclohexyl-4-hydroxy-2-isopropyl-5-[2-(8-propyl-6-pyridin-3-yl-[1,2,4]triazolo[4,3-a]pyrazin-3-yl)-3-pyridin-3-yl-propionylamino]-hexanoic acid (4-hydroxy-butyl)-amide | CHEMBL265486
TypeSmall organic molecule
Emp. Form.C40H56N8O4
Mol. Mass.712.9238
SMILESCCCc1nc(cn2c(nnc12)C(Cc1cccnc1)C(=O)NC(CC1CCCCC1)C(O)CC(C(C)C)C(=O)NCCCCO)-c1cccnc1