Reaction Details
TargetCytoplasmic tyrosine-protein kinase BMX
LigandBDBM50269558
Substrate/Competitorn/a
Meas. Tech.ChEMBL_1706719 (CHEMBL4057952)
IC50 127±n/a nM
Citation Boga, SBAlhassan, ABLiu, JGuiadeen, DKrikorian, AGao, XWang, JYu, YAnand, RLiu, SYang, CWu, HCai, JZhu, HDesai, JMaloney, KGao, YDFischmann, TOPresland, JMansueto, MXu, ZLeccese, EKnemeyer, IGarlisi, CGBays, NStivers, PBrandish, PEHicks, ACooper, AKim, RMKozlowski, JA Discovery of 3-morpholino-imidazole[1,5-a]pyrazine BTK inhibitors for rheumatoid arthritis. Bioorg Med Chem Lett27:3939-3943 (2017) 
 
Cytoplasmic tyrosine-protein kinase BMX
Name:Cytoplasmic tyrosine-protein kinase BMX
Type:Tyrosine-protein kinase
Mol. Mass.:78030.42
Organism:Homo sapiens (Human)
Description:P51813
Residue:675
BDBM50269558
NameBDBM50269558
Synonyms:CHEMBL4077588
TypeSmall organic molecule
Emp. Form.C29H29F4N7O2
Mol. Mass.583.5799
SMILESNc1nccn2c(nc(-c3ccc(cc3F)C(=O)Nc3cc(ccn3)C(F)(F)F)c12)[C@@H]1CCCN(C1)C1CCOCC1