Reaction Details
TargetTyrosine-protein kinase Fgr
LigandBDBM50269615
Substrate/Competitorn/a
Meas. Tech.ChEMBL_1706898 (CHEMBL4058131)
IC50 133±n/a nM
Citation He, LLi, DZhang, CBai, PChen, L Discovery of (R)-5-(benzo[d][1,3]dioxol-5-yl)-7-((1-(vinylsulfonyl)pyrrolidin-2-yl)methyl)-7H-pyrrolo[2,3-d]pyrimidin-4-amine (B6) as a potent Bmx inhibitor for the treatment of NSCLC. Bioorg Med Chem Lett27:4171-4175 (2017) 
 
Tyrosine-protein kinase Fgr
Name:Tyrosine-protein kinase Fgr
Type:protein
Mol. Mass.:59469.88
Organism:Homo sapiens (Human)
Description:P09769
Residue:529
BDBM50269615
NameBDBM50269615
Synonyms:CHEMBL4095253
TypeSmall organic molecule
Emp. Form.C20H21N5O4S
Mol. Mass.427.477
SMILESNc1ncnc2n(C[C@H]3CCCN3S(=O)(=O)C=C)cc(-c3ccc4OCOc4c3)c12