Reaction Details
TargetTransient receptor potential cation channel subfamily A member 1
LigandBDBM50318482
Substrate/Competitorn/a
Meas. Tech.ChEMBL_1707020 (CHEMBL4058253)
EC50 96000±n/a nM
Citation Shirai, TKumihashi, KSakasai, MKusuoku, HShibuya, YOhuchi, A Identification of a Novel TRPM8 Agonist from Nutmeg: A Promising Cooling Compound. ACS Med Chem Lett8:715-719 (2017) 
 
Transient receptor potential cation channel subfamily A member 1
Name:Transient receptor potential cation channel subfamily A member 1
Type:Protein
Mol. Mass.:127514.20
Organism:Homo sapiens (Human)
Description:O75762
Residue:1119
BDBM50318482
NameBDBM50318482
Synonyms:(-)-menthol MENTHOL l-menthol
TypeSmall organic molecule
Emp. Form.C10H20O
Mol. Mass.156.2652
SMILESCC(C)[C@@H]1CC[C@@H](C)C[C@H]1O