Reaction Details
TargetTransient receptor potential cation channel subfamily M member 8
LigandBDBM50318482
Substrate/Competitorn/a
Meas. Tech.ChEMBL_1707019 (CHEMBL4058252)
EC50 10100±n/a nM
Citation Shirai, TKumihashi, KSakasai, MKusuoku, HShibuya, YOhuchi, A Identification of a Novel TRPM8 Agonist from Nutmeg: A Promising Cooling Compound. ACS Med Chem Lett8:715-719 (2017) 
 
Transient receptor potential cation channel subfamily M member 8
Name:Transient receptor potential cation channel subfamily M member 8
Type:Enzyme
Mol. Mass.:127693.26
Organism:Homo sapiens (Human)
Description:Q7Z2W7
Residue:1104
BDBM50318482
NameBDBM50318482
Synonyms:(-)-menthol MENTHOL l-menthol
TypeSmall organic molecule
Emp. Form.C10H20O
Mol. Mass.156.2652
SMILESCC(C)[C@@H]1CC[C@@H](C)C[C@H]1O