Reaction Details
TargetSialidase-3
LigandBDBM50270451
Substrate/Competitorn/a
Meas. Tech.ChEMBL_1708166 (CHEMBL4059399)
IC50 8700±n/a nM
Citation Guo, TDätwyler, PDemina, ERichards, MRGe, PZou, CZheng, RFougerat, APshezhetsky, AVErnst, BCairo, CW Selective Inhibitors of Human Neuraminidase 3. J Med Chem61:1990-2008 (2018) 
 
Sialidase-3
Name:Sialidase-3
Type:PROTEIN
Mol. Mass.:48257.99
Organism:Homo sapiens (Human)
Description:ChEMBL_461856
Residue:428
BDBM50270451
NameBDBM50270451
Synonyms:CHEMBL4084911
TypeSmall organic molecule
Emp. Form.C19H23N5O7
Mol. Mass.433.4152
SMILES[H][C@]1(OC(=C[C@H](O)[C@H]1NC(C)=O)C(O)=O)[C@H](O)[C@H](O)Cn1cc(nn1)-c1ccc(N)cc1